{"text_format":"1","workbook":"xlsx","n_sheets":5,"sheets":["TemplateStudyplan","GPA_DO_NOT_DELETE","Tracks","Major Courses","Compulsory Courses"],"not_rendered":{"charts":0,"images":1,"macros":1,"external_links":0,"defined_names":44,"comments":0,"pivot_tables":0},"unopened":[],"bounds":{"document_bytes":16777216,"sheet_cells":100000,"rows_first":2000,"rows_last":500,"rows_between":2000,"halvings":0,"cell_chars":16384,"cell_head_chars":4096},"cells_cut":0,"cells_raw":0,"read":"whole","date_system":"1900"}

{"sheet":"TemplateStudyplan","index":0,"n_rows":109,"n_cols":19,"rows_kept":109,"cut":false,"hidden":false,"merged":[[88,6,88,17],[87,1,87,17],[76,1,76,17],[77,4,78,4],[77,5,78,5],[77,1,78,1],[77,2,78,2],[77,3,78,3],[88,1,89,1],[88,2,89,2],[88,3,89,3],[88,4,89,4],[88,5,89,5],[66,6,66,17],[77,6,77,17],[66,1,67,1],[66,2,67,2],[66,3,67,3],[66,4,67,4],[66,5,67,5],[31,1,31,17],[54,1,55,1],[54,2,55,2],[54,3,55,3],[54,4,55,4],[54,5,55,5],[53,1,53,17],[54,6,54,17],[32,0,33,0],[32,2,33,2],[32,3,33,3],[32,4,33,4],[32,5,33,5],[32,1,33,1],[59,1,59,17],[9,4,10,4],[9,5,10,5],[9,6,9,17],[8,1,8,17],[22,6,22,17],[21,1,21,17],[9,1,10,1],[9,2,10,2],[9,3,10,3],[22,1,23,1],[22,2,23,2],[22,3,23,3],[22,4,23,4],[22,5,23,5],[32,6,32,17],[98,1,98,17],[99,6,99,17],[74,1,75,1],[85,1,86,1],[60,1,61,1],[60,2,61,2],[60,3,61,3],[65,1,65,17],[60,4,61,4],[60,5,61,5],[60,6,60,17],[99,1,100,1],[99,2,100,2],[99,3,100,3],[99,4,100,4],[99,5,100,5]]}
[]
[null,"Student name: "]
[null,"ID #:"]
[null,"Email:"]
[null,"Year/Month entered LUC:"]
[null,"Major:"]
[null,"Minor: "]
[]
[null,"General Education & Academic Skills (40 EC)"]
[null,"Course Title ","Level","EC #","Additional  Information","Grade","Year / Block"]
[null,null,null,null,null,null,"Y1/B1","Y1/B2","Y1/B3","Y1/B4","Y2/B1","Y2/B2","Y2/B3","Y2/B4","Y3/B1","Y3/B2","Y3/B3","Y3/B4"]
[null,"Global Challenges: Peace & Justice",100,5,null,null,null,null,null,null,null,null,null,null,null,null,null,null,{"$f":"(VLOOKUP(F12, GPA_DO_NOT_DELETE!$A$3:$B$15, 2, FALSE))*D12","v":{"$error":"#N/A"}}]
[null,"Global Challenges: Sustainability",100,5,null,null,null,null,null,null,null,null,null,null,null,null,null,null,{"$f":"(VLOOKUP(F13, GPA_DO_NOT_DELETE!$A$3:$B$15, 2, FALSE))*D13","v":{"$error":"#N/A"}}]
[null,"Global Challenges: Diversity",100,5,null,null,null,null,null,null,null,null,null,null,null,null,null,null,{"$f":"(VLOOKUP(F14, GPA_DO_NOT_DELETE!$A$3:$B$15, 2, FALSE))*D14","v":{"$error":"#N/A"}}]
[null,"Global Challenges: Prosperity",100,5,null,null,null,null,null,null,null,null,null,null,null,null,null,null,{"$f":"(VLOOKUP(F15, GPA_DO_NOT_DELETE!$A$3:$B$15, 2, FALSE))*D15","v":{"$error":"#N/A"}}]
[null,"History of Philosophy ",100,5,null,null,null,null,null,null,null,null,null,null,null,null,null,null,{"$f":"(VLOOKUP(F16, GPA_DO_NOT_DELETE!$A$3:$B$15, 2, FALSE))*D16","v":{"$error":"#N/A"}}]
[null,"Academic Writing",100,5,null,null,null,null,null,null,null,null,null,null,null,null,null,null,{"$f":"(VLOOKUP(F17, GPA_DO_NOT_DELETE!$A$3:$B$15, 2, FALSE))*D17","v":{"$error":"#N/A"}}]
[null,"Statistics",100,5,null,null,null,null,null,null,null,null,null,null,null,null,null,null,{"$f":"(VLOOKUP(F18, GPA_DO_NOT_DELETE!$A$3:$B$15, 2, FALSE))*D18","v":{"$error":"#N/A"}}]
[null,"Mathematical Reasoning",100,5,null,null,null,null,null,null,null,null,null,null,null,null,null,null,{"$f":"(VLOOKUP(F19, GPA_DO_NOT_DELETE!$A$3:$B$15, 2, FALSE))*D19","v":{"$error":"#N/A"}}]
[null,null,"Completed EC General Education and Academic Skills:",{"$f":"SUM(D12:D19)","v":40}," / 40 EC"]
[]
[null,"LUC Electives (15 EC)"]
[null,"Course Title ","Level","EC #","Additional  Information","Grade","Year / Block"]
[null,null,null,null,null,null,"Y1/B1","Y1/B2","Y1/B3","Y1/B4","Y2/B1","Y2/B2","Y2/B3","Y2/B4","Y3/B1","Y3/B2","Y3/B3","Y3/B4"]
[null,null,null,null,null,null,null,null,null,null,null,null,null,null,null,null,null,null,{"$f":"(VLOOKUP(F25, GPA_DO_NOT_DELETE!$A$3:$B$15, 2, FALSE))*D25","v":{"$error":"#N/A"}}]
[null,null,null,null,null,null,null,null,null,null,null,null,null,null,null,null,null,null,{"$f":"(VLOOKUP(F26, GPA_DO_NOT_DELETE!$A$3:$B$15, 2, FALSE))*D26","v":{"$error":"#N/A"}}]
[null,null,null,null,null,null,null,null,null,null,null,null,null,null,null,null,null,null,{"$f":"(VLOOKUP(F27, GPA_DO_NOT_DELETE!$A$3:$B$15, 2, FALSE))*D27","v":{"$error":"#N/A"}}]
[null,null,"Completed EC LUC electives",{"$f":"SUM(D25:D27)","v":0},"/15 EC"]
[]
[null,"*Please note: if you move your first year electives to your Major, the first year electives need to be replaced by other courses"]
[]
[null,"Major (85 ECTS)"]
["Track Title ( also co-convened)","Course Title","Level","EC #","Additional  Information","Grade","Year / Block"]
[null,null,null,null,null,null,"Y1/B1","Y1/B2","Y1/B3","Y1/B4","Y2/B1","Y2/B2","Y2/B3","Y2/B4","Y3/B1","Y3/B2","Y3/B3","Y3/B4"]
[null,null,null,null,null,null,null,null,null,null,null,null,null,null,null,null,null,null,{"$f":"(VLOOKUP(F35, GPA_DO_NOT_DELETE!$A$3:$B$15, 2, FALSE))*D35","v":{"$error":"#N/A"}}]
[null,null,null,null,null,null,null,null,null,null,null,null,null,null,null,null,null,null,{"$f":"(VLOOKUP(F36, GPA_DO_NOT_DELETE!$A$3:$B$15, 2, FALSE))*D36","v":{"$error":"#N/A"}}]
[null,null,null,null,null,null,null,null,null,null,null,null,null,null,null,null,null,null,{"$f":"(VLOOKUP(F37, GPA_DO_NOT_DELETE!$A$3:$B$15, 2, FALSE))*D37","v":{"$error":"#N/A"}}]
[null,null,null,null,null,null,null,null,null,null,null,null,null,null,null,null,null,null,{"$f":"(VLOOKUP(F38, GPA_DO_NOT_DELETE!$A$3:$B$15, 2, FALSE))*D38","v":{"$error":"#N/A"}}]
[null,null,null,null,null,null,null,null,null,null,null,null,null,null,null,null,null,null,{"$f":"(VLOOKUP(F39, GPA_DO_NOT_DELETE!$A$3:$B$15, 2, FALSE))*D39","v":{"$error":"#N/A"}}]
[null,null,null,null,null,null,null,null,null,null,null,null,null,null,null,null,null,null,{"$f":"(VLOOKUP(F40, GPA_DO_NOT_DELETE!$A$3:$B$15, 2, FALSE))*D40","v":{"$error":"#N/A"}}]
{"$rows_left_out":70}
{"sheet":"GPA_DO_NOT_DELETE","index":1,"n_rows":35,"n_cols":2,"rows_kept":35,"cut":false,"hidden":false,"merged":[]}
["Instructions on GPA calculation"]
[]
["A+",4]
["A",4]
["A-",3.7]
["B+",3.3]
["B",3]
["B-",2.7]
["C+",2.2999999999999998]
["C",2]
["C-",1.7]
["D+",1.3]
["D",1]
["D-",0.7]
["F",0]
[]
["1. Do note delete this worksheet, because without it, the GPA calculation will not work."]
[]
["2. In order for the TemplateStudyPlan sheet to calculate your GPA, make sure to insert the ECTS of your courses as well as the letter results. A letter result must match with one of the letters grades in the table above."]
[]
["3. Make sure there are no extra spaces behind the letter grades you insert. So insert \"A+\" and not \"A+ \" (notice the extra space behind the +; also, ignore the quotation marks used here when inserting grades)"]
[]
["4. The calculation will not recognize Passes or Exemptions. If you have obtained such a result, for the purpose of the GPA calculation, leave the ECTS and Grade cells for such a course empty"]
[null,"For example: you have obtained a total of 180ECTS which included an exempted course of 5 ECTS."]
[null,"Insert all the ECTS and grades for your regular courses, but leave the ECTS and Grade cells for the exempted course empty"]
[null,"At the bottom of the sheet, you will notice that your total ECTS is 175--which is correct, because the 5 ECTS of the exemption should not be included in the GPA calculation"]
[]
["5. The sheet will use all inserted ECTS/grades towards your GPA calculation. Therefore, this is the cumulative GPA. "]
[null,"The Final GPA, which is calculated shortly before graduation, includes all results obtained after the first year. "]
[null,"Therefore, if you want to get some idea of your Final GPA, remove the ECTS/Grades of all courses you took during Year 1"]
[null,"For most students, this will be 40 ECTS worth of compulsory Year 1 courses as well as four elective courses "]
[]
["6. Note that this sheet provides an indication of your GPA. Your official GPA will still be calculated by the Course Administration team."]
[]
["7. For questions about the GPA calculation, please contact Joppe Brieffies @ course.administration@luc.leidenuniv.nl"]

{"sheet":"Tracks","index":2,"n_rows":51,"n_cols":8,"rows_kept":51,"cut":false,"hidden":true,"merged":[]}
["EES","Ecosystem Health","Earth System Science","Energy & Natural Resources","EES & GED","Health and Environment"]
[null,"Environmental Science","Earth System Science","Energy & Resource Management","Sharing Scarcity: The Commons","Health, Society and History"]
[null,"Environmental Pollution","Climate Change","Energy Science","Sharing Scarcity: Water","Environmental Pollution "]
[null,"Evolutionary Biology","Earth Science Dynamics, Cycles, and Timescales","Energy and Society","Environmental Governance","Health and Environment"]
[null,"Conservation Biology","Soils, Sediment and Society","Alternative Energy Strategies","Life Cycle Analyses"]
[null,"Ecosystem Services","Water Resource and River Management",null,"Environmental Economics"]
[null,null,null,null,"Environment and Development"]
[]
["GPH","Biomedical Sciences","Health and Development","Health Policy and Politics","Psychology",null,null,{"$f":"IF(COUNTIF(Biomedical_Sciences,I9)>0,\"Biomedical Sciences\", IF(COUNTIF(Earth_System_Science,I9)>0,\"Earth System Science\", IF(COUNTIF(Ecosystem_Health, I9)>0,\"Ecosystem Health\", IF(COUNTIF(EES___GED, I9)>0,\"EES & GED\", IF(COUNTIF(Energy___Natural_Resources, I9)>0, \"Energy & Natural Resources\", IF(COUNTIF(Health_and_Development, I9)>0, \"Hd Development\", IF(COUNTIF(Health_and_Environment,I9)>0, \"Health and Environment\", IF(COUNTIF(Health_Policy_and_Politics,I9>0), \"Health Policy and Politics\", IF(COUNTIF(Psychology, I9) > 0, \"Psychology\", \"\")))))))))","v":""}]
[null,"Nutrition and Health","Medical Anthropolohy","Global Health Policy","Introduction to Psychology"]
[null,"Non-Communicable Diseases","Health and Development: HIV/AIDS in Africa","Ethics, Health and Society: Emerging Responsibilities","Psychology of Stress and Health "]
[null,"Infectious Diseases","Aging and Society",null,"Mental Health & Illness"]
[null,"Health Promotion and Disease Prevention",null,null,"Cognitive Psychology"]
[null,"Maternal and Child Health",null,null,"Applied Development Psychopathology"]
[]
[]
["GED","Institutional Analysis","Policy Science","International Development","Comparative Politics","Political Economy","Economics","GED & IJ"]
[null,"Decision-making Processes","Politics of the Policy Process","Politics and Development","Comparative Party Systems","Political Economy","Principles of Econonomics","Comparative Justice Systems"]
[null,"Institutions in Time","Public Policy Analysis","Human Security","Multi-level Governance","Political Economy of Natural Resources","Microeconomics","Political and Economic Foundations of Law"]
[null,null,null,"Development Project Management",null,"Advanced Political Economy","Macroeconomics","Law, Governance, and Development"]
[null,null,null,null,null,null,"International Economics"]
[null,null,null,null,null,null,"Economics of the European Union"]
[null,null,null,null,null,null,"Economic Growth and Development"]
[]
["HD","Cultural Expressions","Time & Space","Social Forms","Gender Studies","Philosophy","Languages"]
[null,"What is Culture?","Birth of the Modern World","Social Theory in Everyday Life","Introduction to Gender Studies","Philosophies of the World","Sociolinguistics"]
[null,"Contemporary Arts","Historical Approaches: Environmentalisms Rich & Poor","Anthropology of Difference","Women, Human Rights and World Religions","Political Philosophy","Language & Diversity"]
[null,"Cultural Translation","World Regional Geography","Politics of Diversity","Anthropology of Gender & Sexuality","Advanced History of Philosophy: Chinese Philosophy","Language from Individual to World"]
[null,"Political Iconology: Art & Diversity 1600-1800","Asia in Global History: From Colonialism to the Post-cold War Era",null,"Gender & Development","Topics in Philosophy: Bioethics"]
[null,"Politics of Cultural Memory","Empire & Post-empire: Colonial Reformers","Case-studies in Diversity: Public Spaces","Gender, Media & Conflict"]
[null,"Black British Literature","History and Politics of Global Migration","The Political: Theories & Practices","Feminist Philosophy"]
[null,null,null,"Political Ecology: Beyond Nature & Society","Vulnerability, Gender & the Ethics of Care"]
[]
["IJ","International Law","Human Rights and Society","Statehood and Integration"]
[null,"Principles of Public International Law","Introduction to Socio-legal Studies","Sovereignity & Statehood"]
[null,"International Dispute Settlement","Security and Rights","Structure and Functioning of the EU"]
[null,"International Environmental Law","International & Regional Human Rights","Constitutions and Constitutionalism"]
[null,"International Humanitarian Law","Law, Culture and Society","Comparative Legal & Economic Integration"]
[null,"Global Security and Collective Action","Making Human Rights Work","History and Theory of International Norms and Institutions"]
[null,"International Criminal Law","Transitional Justice","Foreign Relations Law"]
{"$rows_left_out":12}
{"sheet":"Major Courses","index":3,"n_rows":38,"n_cols":14,"rows_kept":38,"cut":false,"hidden":false,"merged":[]}
["Majors",null,"Major Courses "]
["EES",null,"EES",null,"GED",null,"GPH",null,"HD",null,"IJ",null,"WP"]
["GED",100,"Environmental Science",100,"Institutions of Governance & Development",null,"Health, Society, and History",{"$f":"IF(COUNTIF(_100_levels,G3)>0,100, IF(COUNTIF(_200_levels,G3)>0,200, IF(COUNTIF(_300_levels, G3)>0,300,\"\")))","v":{"$error":"#REF!"}},"What is Culture?",{"$f":"IF(G3=\"Development Project Management\", 10, IF(G3=\"\", \"\", 5))","v":5},"Principles of Public International Law",{"$f":"IF(COUNTIF(_100_levels,K3)>0,100, IF(COUNTIF(_200_levels,K3)>0,200, IF(COUNTIF(_300_levels, K3)>0,300,\"\")))","v":{"$error":"#REF!"}},"Introduction to IR and Diplomacy",{"$f":"IF(K3=\"Development Project Management\", 10, IF(K3=\"\", \"\", 5))","v":5}]
["GPH",null,"Earth System Science",null,"Introduction to Comparative Politics",null,"Introduction to Epidemiology",null,"Birth of the Modern World",null,"Introduction to Socio-legal Studies",null,"Introduction to Globalisation and Transnational Politics"]
["CHS",null,"Energy & Resource Management",null,"Principles of Econonomics",null,"Social Determinants of Health ",null,"Social Theory in Everyday Life",null,"Sovereignity & Statehood",null,"Introduction to Peace and Conflict Studies"]
["IJ",null,"Sharing Scarcity: The Commons",null,"Comparative Justice Systems",null,"Health Systems Management",null,"Introduction to Gender Studies",null,"Comparative Justice Systems",null,"Birth of the Modern World "]
["WP",null,"Sharing Scarcity: Water",null,"Foundational Texts in Governance, Economics & Development",null,"Health, Society and History",null,"Women, Human Rights and World Religions",null,"Introduction to Gender Studies",null,"Introduction to Gender Studies"]
[null,null,"Health, Society and History",200,"Ethics in Governance, Economics & Development",null,"Introduction to Psychology",null,"Philosophies of the World",null,"Women, Human Rights and World Religions",null,"Women, Human Rights and World Religions"]
["Yes",null,"Biology",null,"Decision-making Processes",200,"Nutrition and Health",null,"Sociolinguistics",200,"International Dispute Settlement",200,"Foreign Policy and Diplomacy"]
["No",null,"Calculus",null,"Politics of the Policy Process",null,"Non-Communicable Diseases",200,"Contemporary Arts",null,"International Environmental Law",null,"Nations and Nationalism"]
[null,null,"Chemistry",null,"Politics and Development",null,"Infectious Diseases",null,"Cultural Translation",null,"International Humanitarian Law",null,"Political Islam in the Middle East"]
["Y1/B1",null,"Physics",null,"Comparative Party Systems",null,"Medical Anthropology",null,"Historical Approaches: Environmentalisms Rich & Poor",null,"Security and Rights",null,"European Integration"]
["Y1/B2",200,"Environmental Pollution",null,"Political Economy",null,"Global Health Policy",null,"World Regional Geography",null,"International & Regional Human Rights",null,"International and Regional Organisations in World Politics"]
["Y1/B3",null,"Evolutionary Biology",null,"Political Economy of Natural Resources",null,"Environmental Pollution",null,"Anthropology of Difference",null,"Law, Culture and Society",null,"International Security Studies"]
["Y1/B4",null,"Climate Change",null,"Microeconomics",null,"Psychology of Stress and Health ",null,"Politics of Diversity",null,"Structure and Functioning of the EU",null,"Conflict and Democracy"]
["Y2/B1",null,"Earth Science Dynamics, Cycles, and Timescales",null,"Macroeconomics",300,"Health Promotion and disease Prevention",null,"Anthropology of Gender & Sexuality",null,"Constitutions and Constitutionalism",null,"Studies in War: From Crimea to the Second World War"]
["Y2/B2",null,"Energy Science",null,"International Economics",null,"Maternal and Child Health",null,"Gender & Development",null,"Political & Economic Foundations of Law",null,"An American Century? The United States in the World since 1898"]
["Y2/B3",null,"Life Cycle Analyses",null,"Political and Economic Foundations of Law",null,"Health and Development: HIV/AIDS in Africa",null,"Gender, Media & Conflict",null,"Anthropology of Gender & Sexuality",null,"Anthropology of Gender & Sexuality"]
["Y2/B4",null,"Environmental Governance",300,"Institutions in Time",null,"Aging and Society",null,"Political Philosophy",null,"Gender & Development",null,"Gender & Development"]
["Y3/B1",null,"Environmental Pollution ",null,"Public Policy Analysis",null,"Ethics, Health and Society: Emerging Responsibilities",null,"Advanced History of Philosophy: Chinese Philosophy",null,"Gender, Media & Conflict",null,"Gender, Media & Conflict"]
["Y3/B2",300,"Ecosystem Services",null,"Human Security",null,"Health and Environment",null,"Language & Diversity",300,"Global Security and Collective Action",300,"Regional Trends: The Rise of China"]
["Y3/B3",null,"Conservation Biology",null,"Development Project Management",null,"Applied Development Psychopathology",300,"Political Iconology: Art & Diversity 1600-1800",null,"International Criminal Law",null,"Regional Trends: Contemporary Russian Politics and Security"]
["Y3/B4",null,"Water Resource and River Management",null,"Multi-level Governance",null,"Cognitive Psychology",null,"Politics of Cultural Memory",null,"Digital Technology and International Law",null,"Multilateral Institutions"]
[null,null,"Soils, Sediment and Society",null,"Advanced Political Economy",null,"Mental Health & Illness",null,"Black British Literature",null,"Making Human Rights Work",null,"Diplomacy of International Conflict"]
[null,null,"Alternative Energy Strategies",null,"Economics of the European Union",null,null,null,"Asia in Global History: From Colonialism to the Post-cold War Era",null,"Transitional Justice",null,"Regional Trends: The EU and Its Neighbourhood"]
[null,null,"Energy and Society",null,"Economic Growth and Development",null,null,null,"Empire & Post-empire: Colonial Reformers",null,"Comparative Legal & Economic Integration",null,"Researching Terrorism and Counterterism"]
[null,null,"Environment and Development",null,null,null,null,null,"History and Politics of Global Migration",null,"History and Theory of International Norms and Institutions",null,"Global Political Economy"]
[null,null,"Environmental Economics",null,null,null,null,null,"Case-studies in Diversity: Public Spaces",null,"Foreign Relations Law",null,"Religion in World Politics"]
[null,null,"Health and Environment",null,null,null,null,null,"The Political: Theories & Practices",null,"Law, Governance & Development",null,"Regional Trends: Political Transitions in Africa"]
[null,null,null,null,null,null,null,null,"Political Ecology: Beyond Nature & Society",null,"Vulnerability, Gender & the Ethics of Care",null,"Systems Thinking in Peace-building, Development and Public Health"]
[null,null,null,null,null,null,null,null,"Vulnerability, Gender & the Ethics of Care",null,"Feminist Philosophy",null,"Ethics of Contemporary War"]
[null,null,null,null,null,null,null,null,"Feminist Philosophy",null,null,null,"Regional Trends: History of the Middle East"]
[null,null,null,null,null,null,null,null,"Topics in Philosophy: Bioethics",null,null,null,"History & Politics of Global Migration "]
[null,null,null,null,null,null,null,null,"Language from Individual to World",null,null,null,"Studies in Conflict: From Algeria to Iraq"]
[null,null,null,null,null,null,null,null,null,null,null,null,"Totalitarianism"]
[null,null,null,null,null,null,null,null,null,null,null,null,"Public Diplomacy: History, Theory, Practice"]
[null,null,null,null,null,null,null,null,null,null,null,null,"Vulnerability, Gender & the Ethics of Care"]
[null,null,null,null,null,null,null,null,null,null,null,null,"Feminist Philosophy"]

{"sheet":"Compulsory Courses","index":4,"n_rows":59,"n_cols":5,"rows_kept":59,"cut":false,"hidden":true,"merged":[]}
["Tracks","EES","level","EC"]
["Ecosystem Health","Environmental Science",100,5]
["Earth System Science","Earth System Science",100,5]
["Energy & Natural Resources","Energy & Resource Management",100,5]
[]
[]
[]
[null,"Quantitative Research Methods",200,5]
[]
[]
[]
[]
[]
[null,"GPH"]
["Core course","Health Systems and Management",100,5,"At least three out of four 100-level courses offered in the core tracks of the major"]
["Core course","Global Histories of Health, Medicine and Disease",100,5,"At least three out of four 100-level courses offered in the core tracks of the major"]
["Core course","Social Determinants of Health ",100,5,"At least three out of four 100-level courses offered in the core tracks of the major"]
["Core course","Healthcare innovation and Artificial Intelligence",100,5,"At least three out of four 100-level courses offered in the core tracks of the major"]
[]
[]
[null,"Quantitative Research Methods",200,5]
[]
[]
[]
[]
[null,"GED"]
[null,"Institutions of Governance & Development",100,5]
[null,"Introduction to Comparative Politics",100,5]
["Economics","Principles of Economics",100,5]
["Institutional Analysis","Decision-making Processes",200,5]
["Institutional Analysis","Institutions in Time",300,5]
[]
[null,"Quantitative Research Methods",200,5]
[]
[]
[]
[]
[]
[]
[null,"HD"]
{"$rows_left_out":19}